{"text_format":"1","workbook":"xlsx","n_sheets":6,"sheets":["Einführung","Begriffe","Bemessungsregendaten, kfu","Nachweisführung","Retention","Konzentrationszeit"],"not_rendered":{"charts":0,"images":6,"macros":1,"external_links":0,"defined_names":2,"comments":3,"pivot_tables":0},"unopened":[],"bounds":{"document_bytes":16777216,"sheet_cells":100000,"rows_first":2000,"rows_last":500,"rows_between":2000,"halvings":0,"cell_chars":16384,"cell_head_chars":4096},"cells_cut":0,"cells_raw":0,"read":"whole","date_system":"1900"}

{"sheet":"Einführung","index":0,"n_rows":57,"n_cols":3,"rows_kept":57,"cut":false,"hidden":false,"merged":[[22,12,22,16],[6,0,6,11],[7,0,7,11],[10,0,10,11],[9,0,9,11],[0,0,1,11],[3,0,3,11],[4,0,4,11],[2,0,2,11],[28,0,28,11],[55,2,55,7],[56,2,56,7],[12,0,12,11],[13,0,13,11],[24,0,24,11],[25,0,25,11],[53,0,53,7],[54,2,54,7],[26,0,26,11],[15,0,15,11],[16,0,16,11],[21,0,21,11],[22,0,22,11],[18,0,18,11],[19,0,19,11]]}
["Bemessung von Anlagen zur Einleitung von Niederschlagswässern \nin Oberflächengewässer in Anlehnung an das ÖWAV-Regelblatt 35"]
[]
["© 2019 ÖWAV    V4-8.2019"]
["1. Beweggründe für die Veröffentlichung eines Excel-Worksheets für Retention und Einleitung von Niederschlagswässern"]
["Zur Unterstützung einer österreichweit einheitlichen Vorgangsweise bei der hydraulischen Bemessung von Entwässerungsanlagen stellt der ÖWAV das gegenständliche Bemessungsprogramm zur Verfügung. Die dem Bemessungsprogramm zu Grunde liegenden Methoden berücksichtigen das ÖWAV-Regelblatt 35 Behandlung von Niederschlagswässern - Einleitung in Oberflächenwässer. \nDa in vielen Fällen im Zuge der Einleitung  eine gedrosselte Einleitung erforderlich ist, wurde für Regenrückhalteräume das einfache Bemessungsverfahren nach Arbeitsblatt DWA-A 117 vom April 2006 mit aufgenommen. Ein automatischer Datenimport aus dem eHYD wurde implementiert."]
[]
["2. Voraussetzung zu Anwendung des Programms"]
["Das Projektgebiet muss kleiner sein als das Einzugsgebiet. Ab einer Projektgebietsgröße von rund 5 ha (0,05 km²) und einer Einzugsgebietsgröße von 5 km² wird empfohlen genauere Ermittlungsverfahren anzuwenden. Das Programm ist bei strömenden Fließverhältnissen anwendbar. Bei schießenden Strömungsverhältnissen ist das Programm nicht anwendbar."]
[]
["3. Vereinfachung"]
["Das Programm nimmt einen stark vereinfachten Zusammenhang zwischen der Jährlichkeit der Regenspende und der Jährlichkeit eines Hochwasserereignisses an. Somit wird bei Auswahl z.B. einer 30-jährlichen Regenspende bei allen nachfolgenden Berechnungen in diesem Programm von einem Hochwasserereignis HQ30 ausgegangen. Dies ist eine stark vereinfachte Methodik."]
[]
["4. Berechnung der Bemessungswassermenge"]
["Im Programm wird davon ausgegangen, dass das Projektgebiet außerhalb des Einzugsgebiets liegt, auch wenn dieses in der Realität komplett oder zum Teil im Einzugsgebiet liegen sollte. Da das Programm nur für kleine Einzugsgebiete und Projektgebiete geeignet ist, ist davon auszugehen, dass diese Herangehensweise im Fall eines im Einzugsgebiet (komplett oder zum Teil) enthaltenen Projektgebietes eine zusätzliche Sicherheit bewirkt."]
[]
["5. Berechnung der Konzentrationszeit"]
["Im ÖWAV Regelblatt 35 werden für die Berechnung der Konzentrationszeit 4 verschiedene Methoden angeführt (nach KREPS, nach KERBY, nach SPECHT, nach CARTER). Für die Berechnung im Programm ergibt sich die Konzentrationszeit aus der Berechnung der Konzentrationszeit mit jeder dieser Methoden, wobei aus diesen 4 Ergebnissen der Mittelwert in die weitere Berechnung einfließt. Bei der Methodik nach SPECHT wird dazu die Berechnung mit 1/2 *L sowie 1/3*L durchgeführt und der MIttelwert gebildet. Ausschließlich der Mittelwert dieser beiden Ergebnisse fließt in die Berechnung des Mittelwertes aus allen 4 Konzentrationszeiten ein."]
[]
["6. Berechnung mit vorhandenen hydrographischen Daten"]
["Wenn für das Einzugsgebiet des Projektstandortes bereits Daten vom hydrographischen Dienst vorhanden sind, kann das Programm durch Drücken des Buttons JA bei den Eingaben umgeschaltet werden. In diesem Fall sind vom Einzugsgebiet ausschließlich die Daten HQ30 und HQ1 erforderlich. Die weiteren Berechnungen beziehen sich hierauf. Die Berechnungen der Konzentrationszeit basieren in diesem Fall ausschließlich auf dem Projektgebiet.\nEin neuerliches Umschalten auf die Berechnung ohne vorhandene Daten erfolgt durch Klick auf den Button NEIN im Bereich Eingaben."]
{"$rows_left_out":38}
{"sheet":"Begriffe","index":1,"n_rows":50,"n_cols":6,"rows_kept":50,"cut":false,"hidden":false,"merged":[[64,0,64,1],[64,2,64,3],[65,0,65,1],[65,2,65,3],[68,0,68,3],[66,0,66,1],[66,2,66,3],[67,0,67,1],[67,2,67,3],[71,0,71,1],[71,2,71,3],[70,0,70,1],[70,2,70,3],[69,0,69,1],[69,2,69,3],[61,0,61,1],[61,2,61,3],[62,2,62,3],[63,0,63,1],[63,2,63,3],[62,0,62,1],[60,0,60,1],[60,2,60,3],[52,0,52,3],[58,0,58,1],[56,0,56,1],[56,2,56,3],[57,0,57,1],[57,2,57,3],[58,2,58,3],[54,2,54,3],[39,0,39,5],[38,0,38,5],[41,0,41,5],[59,0,59,1],[59,2,59,3],[55,0,55,1],[55,2,55,3],[53,0,53,1],[53,2,53,3],[54,0,54,1],[42,1,42,5],[43,1,43,5],[44,1,44,5],[47,1,47,5],[50,0,50,5],[49,0,49,5],[18,0,18,3],[9,0,9,3],[10,0,10,3],[16,0,16,3],[6,0,6,3],[7,0,7,3],[8,0,8,3],[17,0,17,3],[14,0,14,3],[15,0,15,3],[34,0,34,3],[36,0,36,5],[26,0,26,3],[27,0,27,3],[28,0,28,3],[29,0,29,3],[33,0,33,3],[32,0,32,3],[0,5,1,5],[0,0,1,4],[30,0,30,3],[31,0,31,3],[23,0,23,3],[24,0,24,3],[25,0,25,3],[22,0,22,3],[19,0,19,3],[11,0,11,3],[2,0,2,3],[5,0,5,3],[12,0,12,3],[4,0,4,3],[3,0,3,3],[13,0,13,3]]}
["BEGRIFFE UND ABKÜRZUNGEN DER BERECHNUNGSPARAMETER  ",null,null,null,null,{"$f":"Einführung!A3","v":"© 2019 ÖWAV    V4-8.2019"}]
[]
["Verwendete Parameter",null,null,null,"Abkürz.","Einheit"]
["Größe Einzugsgebiet ",null,null,null,"AE","ha"]
["Größe Projektgebiet ",null,null,null,"AP","ha"]
["Länge des Gewässers bis zum Einleitungspunkt ",null,null,null,"LE","km"]
["Länge des Projektgebietes",null,null,null,"LP","km"]
["Höhenunterschied des Gewässers",null,null,null,"HE","m"]
["Höhenunterschied Projektgebiet",null,null,null,"HP","m"]
["Gefälle  Einzugsgebiet",null,null,null,"JE","%"]
["Gefälle  Projektgebiet",null,null,null,"JP","%"]
["Gefälle Gewässer",null,null,null,"J","%"]
["Rauigkeitskoeffizient  Einzugsgebiet",null,null,null,"nE","-"]
["Rauigkeitskoeffizient  Projektgebiet",null,null,null,"nP","-"]
["Abflussbeiwert Einzugsgebiet",null,null,null,"an,E","-"]
["Abflussbeiwert Projektgebiet vor Bebauung",null,null,null,"an,Pvor","-"]
["Abflussbeiwert Projektgebiet nach Bebauung",null,null,null,"an,Pnach","-"]
["Böschungsneigung orographisch rechts",null,null,null,"JB, rechts","-"]
["Böschungsneigung orographisch links",null,null,null," JB, links","-"]
["Höhe Freibord (Gewäsersohle senkrecht bis Böschungskante)",null,null,null,"hF","m"]
{"$rows_left_out":31}
{"sheet":"Bemessungsregendaten, kfu","index":2,"n_rows":43,"n_cols":14,"rows_kept":43,"cut":false,"hidden":false,"merged":[[45,3,45,13],[7,0,7,13],[8,0,8,13],[9,0,11,13],[13,1,13,3],[17,0,17,1],[41,3,41,13],[26,19,26,20],[5,0,5,3],[5,4,5,10],[2,0,2,10],[3,0,3,3],[3,4,3,10],[4,0,4,3],[4,4,4,10],[25,19,25,20]]}
[null,null,null,null,null,null,null,null,null,null,null,null,null,{"$f":"Einführung!A3","v":"© 2019 ÖWAV    V4-8.2019"}]
[]
["ALLGEMEINE PROJEKTDATEN"]
["Projektbezeichnung:",null,null,null,"Testprojekt"]
["Bearbeiter:",null,null,null,"Max Mustermann"]
["Bemerkungen:",null,null,null,"Testprojekt"]
[]
["BEMESSUNGSREGENDATEN"]
["Information:"]
["Die Berechnungen, welche auf den nachfolgenden Blättern durchgeführt werden, beziehen sich auf die in diesem Blatt eingetragenen Regenreihen. Es handelt sich hierbei um die Bemessungsregendaten aus dem ehyd-System.                                                                                                                                                                                                                             Die Daten können auf der ehyd-Homepage (Link: http://ehyd.gv.at/# ) heruntergeladen werden und in weiterer Folge per Hand oder automatisch in die unten angeführte Liste eingetragen werden. Dazu müssen Sie auf der Homepage den Punkt \"Kennwerte und Bemessung\" und den Unterpunkt \"Bemessungsregen\" anklicken. Dann erscheinen die Gitterpunkte mit den Bemessungregendaten. Sie müssen auf den gewünschten Punkt klicken und die Datei als ASCII-Datei herunterladen und im Ordner \"ehyd_Regendaten\" speichern."]
[]
[]
[]
["Link:","ehyd-Regendatenbank"]
[]
[]
[]
["Gitterpunkt",null,null,2862]
[]
["DAUER","MIN",0,1,2,3,5,10,20,25,30,50,75,100]
{"$rows_left_out":24}
{"sheet":"Nachweisführung","index":3,"n_rows":137,"n_cols":25,"rows_kept":137,"cut":false,"hidden":false,"merged":[[136,0,136,1],[135,0,135,1],[134,0,134,1],[125,3,125,4],[125,5,125,6],[134,3,134,6],[124,5,124,6],[125,0,125,1],[104,0,104,6],[128,5,128,6],[130,0,131,6],[118,0,118,1],[118,3,118,4],[118,5,118,6],[120,0,121,6],[127,0,127,1],[127,3,127,4],[127,5,127,6],[128,0,128,1],[128,3,128,4],[115,0,115,1],[115,3,115,4],[115,5,115,6],[123,0,123,6],[124,0,124,1],[124,3,124,4],[103,5,103,6],[109,0,109,1],[109,3,109,4],[109,5,109,6],[117,0,117,1],[117,3,117,4],[117,5,117,6],[110,0,110,1],[110,3,110,4],[110,5,110,6],[111,0,111,6],[113,0,113,6],[114,0,114,1],[114,3,114,4],[105,0,105,6],[101,13,101,14],[102,0,102,1],[102,3,102,4],[102,5,102,6],[100,0,100,6],[39,0,39,2],[77,0,77,1],[47,3,47,6],[40,3,40,4],[44,0,44,1],[54,0,54,6],[93,0,94,2],[50,13,50,14],[51,0,51,1],[51,3,51,4],[51,5,51,6],[52,0,52,1],[52,3,52,4],[47,0,47,1],[40,5,40,6],[41,5,41,6],[42,5,42,6],[43,5,43,6],[44,5,44,6],[15,0,15,1],[15,3,15,4],[15,5,15,6],[20,0,20,1],[23,0,23,1],[23,3,23,4],[101,0,101,1],[101,3,101,4],[101,5,101,6],[84,3,84,6],[85,0,85,1],[85,3,85,4],[85,5,85,6],[35,0,35,1],[38,0,38,6],[39,3,39,6],[52,5,52,6],[53,0,53,6],[58,5,58,6],[32,5,32,6],[36,0,36,1],[49,0,49,6],[50,5,50,6],[46,0,46,6],[0,0,0,1],[1,0,1,1],[2,0,2,1],[2,2,2,6],[1,2,1,6],[0,2,0,6],[8,5,8,6],[9,5,9,6],[6,0,6,6],[9,0,9,1],[9,3,9,4],[7,0,7,1],[7,3,7,4],[8,0,8,1],[8,3,8,4],[4,0,4,6],[3,4,3,6],[5,0,5,2],[7,5,7,6],[44,3,44,4],[50,3,50,4],[67,0,67,1],[67,3,67,4],[66,0,66,1],[66,3,66,4],[63,0,63,1],[63,3,63,4],[58,0,58,1],[58,3,58,4],[97,0,97,6],[64,0,64,1],[64,3,64,4],[136,3,136,4],[133,0,133,6],[59,0,59,1],[59,3,59,4],[91,0,91,6],[135,5,135,6],[77,3,77,4],[77,5,77,6],[88,0,88,6],[89,0,89,1],[69,0,70,6],[83,0,83,6],[84,0,84,2],[92,0,92,2],[92,3,92,6],[86,0,86,1],[86,3,86,4],[86,5,86,6],[114,5,114,6],[103,0,103,1],[103,3,103,4],[136,5,136,6],[59,5,59,6],[60,0,60,6],[62,0,62,6],[63,5,63,6],[64,5,64,6],[66,5,66,6],[72,0,72,6],[73,0,73,1],[98,0,98,1],[98,3,98,6],[73,3,73,4],[73,5,73,6],[74,0,74,1],[74,3,74,4],[74,5,74,6],[79,0,80,6],[67,5,67,6],[76,0,76,1],[76,3,76,4],[76,5,76,6],[135,3,135,4],[93,5,93,6],[94,5,94,6],[95,3,95,4],[95,0,95,1],[29,3,29,6],[24,0,24,1],[24,3,24,4],[25,0,25,1],[33,5,33,6],[16,0,16,1],[16,3,16,4],[16,5,16,6],[17,0,17,1],[17,3,17,4],[26,5,26,6],[26,0,26,1],[26,3,26,4],[28,0,28,6],[34,0,34,6],[22,3,22,4],[30,3,31,4],[30,5,31,6],[30,0,31,2],[29,0,29,2],[95,5,95,6],[50,0,50,1],[10,3,10,4],[24,5,24,6],[10,0,10,1],[32,0,32,1],[32,3,32,4],[33,0,33,1],[33,3,33,4],[17,5,17,6],[25,3,25,4],[23,5,23,6],[25,5,25,6],[13,0,13,6],[20,3,20,4],[21,0,21,1],[21,3,21,4],[11,0,11,1],[11,3,11,4],[11,5,11,6],[22,0,22,1],[19,0,19,6],[20,5,20,6],[14,0,14,1],[14,3,14,4],[14,5,14,6]]}
["Projektbezeichnung:",null,{"$f":"'Bemessungsregendaten, kfu'!E4","v":"Testprojekt"}]
["Bearbeiter:",null,{"$f":"'Bemessungsregendaten, kfu'!E5","v":"Max Mustermann"},null,null,null,null,null,null,null,null,null,null,null,{"$f":"'Bemessungsregendaten, kfu'!D20","v":1},{"$f":"'Bemessungsregendaten, kfu'!E20","v":2},{"$f":"'Bemessungsregendaten, kfu'!F20","v":3},{"$f":"'Bemessungsregendaten, kfu'!G20","v":5},{"$f":"'Bemessungsregendaten, kfu'!H20","v":10},{"$f":"'Bemessungsregendaten, kfu'!I20","v":20},{"$f":"'Bemessungsregendaten, kfu'!J20","v":25},{"$f":"'Bemessungsregendaten, kfu'!K20","v":30},{"$f":"'Bemessungsregendaten, kfu'!L20","v":50},{"$f":"'Bemessungsregendaten, kfu'!M20","v":75},{"$f":"'Bemessungsregendaten, kfu'!N20","v":100}]
["Bemerkungen:",null,{"$f":"'Bemessungsregendaten, kfu'!E6","v":"Testprojekt"}]
[null,null,null,null,{"$f":"Einführung!A3","v":"© 2019 ÖWAV    V4-8.2019"}]
["EINGABEN"]
["Hydrographische Daten vorhanden",null,null,{"$f":"IF(M6=\"ja\",\"ja\",\"nein\")","v":"nein"},{"$f":"IF(M6=\"nein\",\"ja\",\"nein\")","v":"ja"},null,null,null,null,null,null,null,"nein"]
["Angaben Einzugsgebiet E",null,null,"Projektgebiet P"]
["Größe des Einzugsgebietes AE:",null,42,"Mittleres Gefälle des Einzugsgebiets JE:",null,{"$f":"C10/(C9*1000)","v":3.7999999999999999E-2}]
["Länge bis zum Einleitungspunkt LE:",null,1,"Rauigkeitskoeffizient vom Einzugsgebiet nE:",null,0.04]
["Höhenunterschied HE:",null,38,"Abflussbeiwert an,E:",null,0.2]
[]
["HQ30",null,2.0099999999999998,"HQ1",null,0.75]
[]
["Angaben Projektgebiet P"]
["Größe des Projektgebietes AP:",null,1.2,"Mittleres Gefälle des Projektgebiets JP:",null,{"$f":"C17/(C16*1000)","v":5.333333333333334E-3}]
["Länge bis zum Einleitungspunkt LP:",null,0.15,"Rauigkeitskoeffizient nP:",null,3.3000000000000002E-2]
["Höhenunterschied HP:",null,0.8,"mittlerer Abflussbeiwert an,Pvor:",null,0.2]
[null,null,null,"mittlerer Abflussbeiwert an,Pnach:",null,0.8]
[null,null,null,null,null,null,null,null,null,null,"F22 und 23","Höhe"]
["Gewässer",null,null,null,null,null,null,null,null,null,"G22 und G23","Breite"]
{"$rows_left_out":118}
{"sheet":"Retention","index":4,"n_rows":45,"n_cols":17,"rows_kept":45,"cut":false,"hidden":false,"merged":[[39,0,39,1],[44,0,44,1],[47,0,51,7],[41,0,41,7],[42,0,42,1],[42,2,42,3],[43,0,43,1],[43,2,43,3],[42,4,44,7],[40,0,40,7],[24,0,24,1],[35,0,35,1],[36,0,36,1],[37,0,37,1],[38,0,38,1],[25,0,25,1],[26,0,26,1],[27,0,27,1],[29,0,29,1],[30,0,30,1],[31,0,31,1],[9,0,9,7],[28,0,28,1],[15,0,16,1],[15,2,15,3],[15,4,39,7],[16,2,16,3],[17,0,17,1],[18,0,18,1],[19,0,19,1],[20,0,20,1],[32,0,32,1],[33,0,33,1],[34,0,34,1],[21,0,21,1],[22,0,22,1],[23,0,23,1],[14,0,14,3],[14,4,14,7],[10,0,10,3],[10,5,10,6],[11,0,11,3],[11,5,11,6],[12,0,12,3],[12,5,12,6],[13,0,13,7],[0,0,0,1],[0,2,0,7],[1,0,1,1],[1,2,1,7],[2,0,2,1],[2,2,2,7],[8,1,8,3],[8,4,8,5],[3,0,3,7],[4,0,4,7],[5,0,5,7],[6,1,6,2],[6,4,6,5],[6,6,6,7],[8,6,8,7],[7,1,7,2],[7,4,7,5],[7,6,7,7]]}
["Projektbezeichnung:",null,{"$f":"'Bemessungsregendaten, kfu'!E4","v":"Testprojekt"}]
["Bearbeiter:",null,{"$f":"'Bemessungsregendaten, kfu'!E5","v":"Max Mustermann"},null,null,null,null,null,null,null,null,1]
["Bemerkungen:",null,{"$f":"'Bemessungsregendaten, kfu'!E6","v":"Testprojekt"},null,null,null,null,null,null,null,null,2]
[{"$f":"Einführung!A3","v":"© 2019 ÖWAV    V4-8.2019"},null,null,null,null,null,null,null,null,null,null,3]
["EINGABEN",null,null,null,null,null,null,null,null,null,null,5]
["Einzugsflächen",null,null,null,null,null,null,null,null,null,null,10]
["Bezeichnung Einzugsfläche","Art der Entwässerungsfläche",null,"Abflussbeiwert αn","An [m²]",null,"Teileinzugsflächen  Ared [m²]",null,null,null,null,20]
["Teilfläche 1",null,null,{"$f":"Nachweisführung!F18","v":0.8},{"$f":"Nachweisführung!C15*10000","v":12000},null,{"$f":"D8*E8","v":9600},null,null,null,null,25]
[null,"GESAMTEINZUGSFLÄCHE",null,null,{"$f":"SUM(E8:F8)","v":12000},null,{"$f":"SUM(G8:H8)","v":9600},null,null,null,null,30]
[null,null,null,null,null,null,null,null,null,null,null,50]
[{"$f":"Nachweisführung!D102","v":30},null,null,null,"QD",{"$f":"IF(Nachweisführung!C135=\"-\",\"-\",Nachweisführung!C135*1000)","v":58},null,null,null,null,null,75]
["Zuschlagsfaktor",null,null,null,"fz",1.1000000000000001,null,null,null,null,null,100]
["Abminderungsfaktor",null,null,null,"fa",0.78]
[]
["Berechnung Retentionsvolumen"]
[{"$f":"'Bemessungsregendaten, kfu'!D18","v":2862},null,"Jährlichkeit"]
[null,null,30]
["DAUER",null,"Regenhöhe qr [l/m²]","erford. Speicher-volumen Vs [m³]",null,null,null,null,null,null,null,null,"Drossel reduziert",null,"Abflussrate (Drossel)","Zufluss","Zufluss - Abfluss"]
["0 min",null,0,0,null,null,null,null,null,null,null,null,null,"MIN","m³","m³"]
["5 min.",null,{"$f":"HLOOKUP($C$17,'Bemessungsregendaten, kfu'!$D$20:$N$41,2,0)","v":18.100000000000001},{"$f":"Q21*$F$12*$F$13","v":139.13328000000001},null,null,null,null,null,null,null,null,{"$f":"F11*2/3","v":38.666666666666664},0,0,0,0]
{"$rows_left_out":26}
{"sheet":"Konzentrationszeit","index":5,"n_rows":72,"n_cols":21,"rows_kept":72,"cut":false,"hidden":false,"merged":[[8,0,8,1],[1,7,1,9],[0,0,0,9],[3,0,3,1],[4,0,4,1],[7,0,7,1],[12,0,12,1],[20,0,20,1],[21,0,21,1],[11,0,11,1],[50,19,51,19],[32,16,32,17],[33,16,33,17],[26,19,27,19]]}
["Konzentrationszeit"]
[null,null,null,null,null,null,null,{"$f":"Einführung!A3","v":"© 2019 ÖWAV    V4-8.2019"}]
["nach Kreps: tc = 0,89 * EG0,4 – 0,15"]
["Einzugsgebiet: ",null,{"$f":"0.89*POWER((Nachweisführung!C8/100),0.4)-0.15","v":0.47905659930201971},"Stunden"]
["Projektgebiet:",null,{"$f":"0.89*POWER((Nachweisführung!C15/100),0.4)-0.15","v":1.7268721958809685E-3},"Stunden"]
[]
["nach Kerby: tc = 0,7452 * L0,47 * n0,47 * J-0,235"]
["Einzugsgebiet: ",null,{"$f":"0.7452*POWER(Nachweisführung!C9,0.47)*POWER(Nachweisführung!F9,0.47)*POWER(Nachweisführung!F8,-0.235)","v":0.35399073627068212},"Stunden"]
["Projektgebiet:",null,{"$f":"0.7452*POWER(Nachweisführung!C16,0.47)*POWER(Nachweisführung!F16,0.47)*POWER(Nachweisführung!F15,-0.235)","v":0.21032581897208172},"Stunden"]
[]
["nach Specht: tc = (1/2 bis 1/3) * L"]
["Einzugsgebiet: ",null,{"$f":"Nachweisführung!C9/2","v":0.5},"Stunden","bis",{"$f":"Nachweisführung!C9/3","v":0.33333333333333331},"Stunden","gemittelt",{"$f":"(C12+F12)/2","v":0.41666666666666663},"Stunden"]
["Projektgebiet:",null,{"$f":"Nachweisführung!C16/2","v":7.4999999999999997E-2},"Stunden","bis",{"$f":"Nachweisführung!C16/3","v":4.9999999999999996E-2},"Stunden","gemittelt",{"$f":"(C13+F13)/2","v":6.25E-2},"Stunden"]
[]
["nach Carter: tc = 0,09765 * L0,6 * J-0,3"]
["Einzugsgebiet:",null,{"$f":"0.09765*Nachweisführung!C9^0.6*Nachweisführung!F8^(-0.3)","v":0.26045768049938822},"Stunden"]
["Projektgebiet:",null,{"$f":"0.09765*Nachweisführung!C16^0.6*Nachweisführung!F15^(-0.3)","v":0.15039291760494494},"Stunden"]
[]
[]
["Median der Konzentrationszeiten"]
{"$rows_left_out":52}